{"text_format":"1","workbook":"xlsx","n_sheets":6,"sheets":["Configurator_EN","Order_list","Prices","v","a","Valves actuators list"],"not_rendered":{"charts":0,"images":15,"macros":1,"external_links":2,"defined_names":17,"comments":0,"pivot_tables":0},"unopened":[],"bounds":{"document_bytes":16777216,"sheet_cells":100000,"rows_first":2000,"rows_last":500,"rows_between":2000,"halvings":0,"cell_chars":16384,"cell_head_chars":4096},"cells_cut":0,"cells_raw":0,"read":"whole","date_system":"1900"}

{"sheet":"Configurator_EN","index":0,"n_rows":39,"n_cols":28,"rows_kept":39,"cut":false,"hidden":false,"merged":[[36,2,36,15],[37,2,37,11],[2,16,2,17],[2,14,2,15],[25,1,25,10],[27,1,27,10],[28,1,28,10],[29,1,29,10],[30,1,30,10],[32,1,32,16]]}
[null,null,null,null,null,null,null,null,null,null,null,null,"-","-"]
[]
[null,"            V5005",null,"            V5004",null,null,null,null,null,null,null,"           MT4/MT8  ",null,null,"        M6410/7410",null,"M5410 ",null,null,"          M6061/M7061"]
[]
[]
[]
[]
[]
[null,null,null,null,null,null,null,null,null,null,null,null,null,null,null,null,null,null,null,null,null,null,null,null,null,null,null,"VMS242A008 (blue)"]
[null,null,null,null,null,null,null,null,null,null,null,null,null,null,null,null,null,null,null,null,null,null,"Measuring connectors: VS2600C1",null,null,null,null,"VMS242A009 (red)"]
{"$rows_left_out":30}
{"sheet":"Order_list","index":1,"n_rows":125,"n_cols":40,"rows_kept":125,"cut":false,"hidden":false,"merged":[]}
["Project, position","Valve\nPart number","Valve  \ndescription",null,"Actuator \npart number",null,"Actuator\ndescription","Price of \nthe valve","Price of\n the actuator","Valve QTY","Actuator QTY","Total price",null,"Functions"]
[null,null,{"$f":"IFERROR(VLOOKUP(B2,'Valves actuators list'!$A$1:$B$38,2,FALSE),\"\")","v":""},null,null,null,{"$f":"IFERROR(VLOOKUP(E2,'Valves actuators list'!$C$1:$D$49,2,FALSE),\"\")","v":""},{"$f":"IFERROR(VLOOKUP(B2,Prices!$A$2:$B$87,2,FALSE),\"\")","v":""},{"$f":"IFERROR(VLOOKUP(E2,Prices!A2:B87,2,FALSE),\"\")","v":""},null,null,{"$f":"IFERROR(IF(I2=\"\",H2*J2,(H2*J2)+(I2*K2)),\"\")","v":""}]
[null,null,{"$f":"IFERROR(VLOOKUP(B3,'Valves actuators list'!$A$1:$B$38,2,FALSE),\"\")","v":""},null,null,null,{"$f":"IFERROR(VLOOKUP(E3,'Valves actuators list'!$C$1:$D$49,2,FALSE),\"\")","v":""},{"$f":"IFERROR(VLOOKUP(B3,Prices!$A$2:$B$87,2,FALSE),\"\")","v":""},{"$f":"IFERROR(VLOOKUP(E3,Prices!A3:B88,2,FALSE),\"\")","v":""},null,null,{"$f":"IFERROR(IF(I3=\"\",H3*J3,(H3*J3)+(I3*K3)),\"\")","v":""},null,null,null,null,null,null,null,null,null,null,null,null,null,null,null,null,"MT4-230-NC-2.5M","V5004TY10150150","V5004T1","Therm NC","2Pt, 3Pt",null,{"$f":"VLOOKUP(N10,$AD$4:$AE$37,2,FALSE)","v":{"$error":"#N/A"}},"A",{"$f":"VLOOKUP(N10,AD3:AJ36,7,FALSE)","v":{"$error":"#N/A"}},null,null,"V5004TY10252200"]
[null,null,{"$f":"IFERROR(VLOOKUP(B4,'Valves actuators list'!$A$1:$B$38,2,FALSE),\"\")","v":""},null,null,null,{"$f":"IFERROR(VLOOKUP(E4,'Valves actuators list'!$C$1:$D$49,2,FALSE),\"\")","v":""},{"$f":"IFERROR(VLOOKUP(B4,Prices!$A$2:$B$87,2,FALSE),\"\")","v":""},{"$f":"IFERROR(VLOOKUP(E4,Prices!A4:B89,2,FALSE),\"\")","v":""},null,null,""]
[null,null,{"$f":"IFERROR(VLOOKUP(B5,'Valves actuators list'!$A$1:$B$38,2,FALSE),\"\")","v":""},null,null,null,{"$f":"IFERROR(VLOOKUP(E5,'Valves actuators list'!$C$1:$D$49,2,FALSE),\"\")","v":""},{"$f":"IFERROR(VLOOKUP(B5,Prices!$A$2:$B$87,2,FALSE),\"\")","v":""},{"$f":"IFERROR(VLOOKUP(E5,Prices!A5:B90,2,FALSE),\"\")","v":""},null,null,""]
[null,null,{"$f":"IFERROR(VLOOKUP(B6,'Valves actuators list'!$A$1:$B$38,2,FALSE),\"\")","v":""},null,null,null,{"$f":"IFERROR(VLOOKUP(E6,'Valves actuators list'!$C$1:$D$49,2,FALSE),\"\")","v":""},{"$f":"IFERROR(VLOOKUP(B6,Prices!$A$2:$B$87,2,FALSE),\"\")","v":""},{"$f":"IFERROR(VLOOKUP(E6,Prices!A6:B91,2,FALSE),\"\")","v":""},null,null,""]
[null,null,{"$f":"IFERROR(VLOOKUP(B7,'Valves actuators list'!$A$1:$B$38,2,FALSE),\"\")","v":""},null,null,null,{"$f":"IFERROR(VLOOKUP(E7,'Valves actuators list'!$C$1:$D$49,2,FALSE),\"\")","v":""},{"$f":"IFERROR(VLOOKUP(B7,Prices!$A$2:$B$87,2,FALSE),\"\")","v":""},{"$f":"IFERROR(VLOOKUP(E7,Prices!A7:B92,2,FALSE),\"\")","v":""},null,null,""]
[null,null,{"$f":"IFERROR(VLOOKUP(B8,'Valves actuators list'!$A$1:$B$38,2,FALSE),\"\")","v":""},null,null,null,{"$f":"IFERROR(VLOOKUP(E8,'Valves actuators list'!$C$1:$D$49,2,FALSE),\"\")","v":""},{"$f":"IFERROR(VLOOKUP(B8,Prices!$A$2:$B$87,2,FALSE),\"\")","v":""},{"$f":"IFERROR(VLOOKUP(E8,Prices!A8:B93,2,FALSE),\"\")","v":""},null,null,""]
[null,null,{"$f":"IFERROR(VLOOKUP(B9,'Valves actuators list'!$A$1:$B$38,2,FALSE),\"\")","v":""},null,null,null,{"$f":"IFERROR(VLOOKUP(E9,'Valves actuators list'!$C$1:$D$49,2,FALSE),\"\")","v":""},{"$f":"IFERROR(VLOOKUP(B9,Prices!$A$2:$B$87,2,FALSE),\"\")","v":""},{"$f":"IFERROR(VLOOKUP(E9,Prices!A9:B94,2,FALSE),\"\")","v":""},null,null,""]
[null,null,{"$f":"IFERROR(VLOOKUP(B10,'Valves actuators list'!$A$1:$B$38,2,FALSE),\"\")","v":""},null,null,null,{"$f":"IFERROR(VLOOKUP(E10,'Valves actuators list'!$C$1:$D$49,2,FALSE),\"\")","v":""},{"$f":"IFERROR(VLOOKUP(B10,Prices!$A$2:$B$87,2,FALSE),\"\")","v":""},{"$f":"IFERROR(VLOOKUP(E10,Prices!A10:B95,2,FALSE),\"\")","v":""},null,null,""]
{"$rows_left_out":116}
{"sheet":"Prices","index":2,"n_rows":87,"n_cols":2,"rows_kept":87,"cut":false,"hidden":false,"merged":[]}
["Parts numbers","Price local Currency"]
["MT4-024-NO"]
["MT4-024-NO-2.5M"]
["MT4-024S-NO"]
["MT4-024-NC"]
["MT4-024-NC-2.5M"]
["MT4-024S-NC"]
["MT4-230-NO"]
["MT4-230-NO-2.5M"]
["MT4-230S-NO"]
{"$rows_left_out":78}
{"sheet":"v","index":3,"n_rows":40,"n_cols":31,"rows_kept":40,"cut":false,"hidden":true,"merged":[]}
["V5004T1","V5004TY10150150","Yes",45,150,15,2.9,"Linear","A","Int. thread","eq%",1,{"$f":"D1*1.3","v":58.5},{"$f":"E1*0.85","v":127.5},{"$f":"P1&\":\"&COUNTIF($P$1:P1,P1)","v":"93:1"},{"$f":"IFERROR((M1+N1)/2,0)","v":93},{"$f":"ABS($AE$7-P1)","v":93},{"$f":"RANK(Q1,$Q$1:$Q$38,1)+COUNTIF($Q$1:Q1,Q1)-1","v":1},{"$f":"IF(AND($AE$7>(Q1*90%),$AE$7<N1),B1,\"\")","v":""},{"$f":"IF(S1=B1,P1,\"\")","v":""},{"$f":"IFERROR((T1-$AE$7),\"\")","v":""},{"$f":"IFERROR(ABS(U1),\"\")","v":""},{"$f":"IF(S1=B1,L1,\"\")","v":""},{"$f":"IFERROR(SMALL($W$1:$W$38,ROWS(W$1:$W1)),\"\")","v":""},{"$f":"RANK(AA1,$AA$1:$AA$20,1)+COUNTIF($AA$1:AA1,AA1)-1","v":{"$error":"#VALUE!"}},{"$f":"IFERROR(INDEX($B$1:$L$38,$X1,COLUMNS($B$1:B1)),\"\")","v":""},{"$f":"VLOOKUP(Z1,S1:V38,4,FALSE)","v":""},{"$f":"IFERROR(VLOOKUP(1,$Y$1:$Z$20,2,FALSE),\"\")","v":""},{"$f":"IFERROR(VLOOKUP(AB1,$B$1:$I$38,8,FALSE),\"\")","v":""}]
["V5004T1","V5004TY10150600","Yes",60,600,15,2.9,"Linear","A","Int. thread","eq%",2,78,510,{"$f":"P2&\":\"&COUNTIF($P$1:P2,P2)","v":"294:1"},294,294,{"$f":"RANK(Q2,$Q$1:$Q$38,1)+COUNTIF($Q$1:Q2,Q2)-1","v":4},"","","","","",{"$f":"IFERROR(SMALL($W$1:$W$38,ROWS(W$1:$W2)),\"\")","v":""},{"$f":"RANK(AA2,$AA$1:$AA$20,1)+COUNTIF($AA$1:AA2,AA2)-1","v":{"$error":"#VALUE!"}},{"$f":"IFERROR(INDEX($B$1:$L$38,$X2,COLUMNS($B$1:B2)),\"\")","v":""},"",{"$f":"IFERROR(VLOOKUP(2,$Y$1:$Z$20,2,FALSE),\"\")","v":""},""]
["V5004T1","V5004TY10150780","Yes",78,780,15,2.9,"Linear","A","Int. thread","eq%",3,101.4,663,{"$f":"P3&\":\"&COUNTIF($P$1:P3,P3)","v":"382,2:1"},382.2,382.2,{"$f":"RANK(Q3,$Q$1:$Q$38,1)+COUNTIF($Q$1:Q3,Q3)-1","v":5},"","","","","",{"$f":"IFERROR(SMALL($W$1:$W$38,ROWS(W$1:$W3)),\"\")","v":""},{"$f":"RANK(AA3,$AA$1:$AA$20,1)+COUNTIF($AA$1:AA3,AA3)-1","v":{"$error":"#VALUE!"}},{"$f":"IFERROR(INDEX($B$1:$L$38,$X3,COLUMNS($B$1:B3)),\"\")","v":""},"",{"$f":"IFERROR(VLOOKUP(3,$Y$1:$Z$20,2,FALSE),\"\")","v":""},""]
["V5004T1","V5004TY10201000","Yes",100,1000,20,2.9,"Linear","A","Int. thread","eq%",4,130,850,{"$f":"P4&\":\"&COUNTIF($P$1:P4,P4)","v":"490:1"},490,490,{"$f":"RANK(Q4,$Q$1:$Q$38,1)+COUNTIF($Q$1:Q4,Q4)-1","v":6},"","","","","",{"$f":"IFERROR(SMALL($W$1:$W$38,ROWS(W$1:$W4)),\"\")","v":""},{"$f":"RANK(AA4,$AA$1:$AA$20,1)+COUNTIF($AA$1:AA4,AA4)-1","v":{"$error":"#VALUE!"}},{"$f":"IFERROR(INDEX($B$1:$L$38,$X4,COLUMNS($B$1:B4)),\"\")","v":""},"",{"$f":"IFERROR(VLOOKUP(4,$Y$1:$Z$20,2,FALSE),\"\")","v":""},""]
["V5004T1","V5004TY10201500","Yes",450,1500,20,2.9,"Linear","A","Int. thread","eq%",5,585,1275,{"$f":"P5&\":\"&COUNTIF($P$1:P5,P5)","v":"930:1"},930,930,{"$f":"RANK(Q5,$Q$1:$Q$38,1)+COUNTIF($Q$1:Q5,Q5)-1","v":17},"","","","","",{"$f":"IFERROR(SMALL($W$1:$W$38,ROWS(W$1:$W5)),\"\")","v":""},{"$f":"RANK(AA5,$AA$1:$AA$20,1)+COUNTIF($AA$1:AA5,AA5)-1","v":{"$error":"#VALUE!"}},{"$f":"IFERROR(INDEX($B$1:$L$38,$X5,COLUMNS($B$1:B5)),\"\")","v":""},"",{"$f":"IFERROR(VLOOKUP(5,$Y$1:$Z$20,2,FALSE),\"\")","v":""},""]
["V5004T1","V5004TY10251500","Yes",450,1500,25,2.9,"Linear","A","Int. thread","eq%",6,585,1275,{"$f":"P6&\":\"&COUNTIF($P$1:P6,P6)","v":"930:2"},930,930,{"$f":"RANK(Q6,$Q$1:$Q$38,1)+COUNTIF($Q$1:Q6,Q6)-1","v":18},"","","","","",{"$f":"IFERROR(SMALL($W$1:$W$38,ROWS(W$1:$W6)),\"\")","v":""},{"$f":"RANK(AA6,$AA$1:$AA$20,1)+COUNTIF($AA$1:AA6,AA6)-1","v":{"$error":"#VALUE!"}},{"$f":"IFERROR(INDEX($B$1:$L$38,$X6,COLUMNS($B$1:B6)),\"\")","v":""},"",{"$f":"IFERROR(VLOOKUP(6,$Y$1:$Z$20,2,FALSE),\"\")","v":""},"","Flow calculation"]
["V5004T2","V5004TY10202200","Yes",220,2200,20,6,"Linear","B","ext. thread","eq%",7,286,1870,{"$f":"P7&\":\"&COUNTIF($P$1:P7,P7)","v":"1078:1"},1078,1078,{"$f":"RANK(Q7,$Q$1:$Q$38,1)+COUNTIF($Q$1:Q7,Q7)-1","v":19},"","","","","",{"$f":"IFERROR(SMALL($W$1:$W$38,ROWS(W$1:$W7)),\"\")","v":""},{"$f":"RANK(AA7,$AA$1:$AA$20,1)+COUNTIF($AA$1:AA7,AA7)-1","v":{"$error":"#VALUE!"}},{"$f":"IFERROR(INDEX($B$1:$L$38,$X7,COLUMNS($B$1:B7)),\"\")","v":""},"",{"$f":"IFERROR(VLOOKUP(7,$Y$1:$Z$20,2,FALSE),\"\")","v":""},"","Requ flow",{"$f":"Configurator_EN!C14","v":0}]
["V5004T2","V5004TY10202700","Yes",270,2700,20,6,"Linear","B","ext. thread","eq%",8,351,2295,{"$f":"P8&\":\"&COUNTIF($P$1:P8,P8)","v":"1323:1"},1323,1323,{"$f":"RANK(Q8,$Q$1:$Q$38,1)+COUNTIF($Q$1:Q8,Q8)-1","v":21},"","","","","",{"$f":"IFERROR(SMALL($W$1:$W$38,ROWS(W$1:$W8)),\"\")","v":""},{"$f":"RANK(AA8,$AA$1:$AA$20,1)+COUNTIF($AA$1:AA8,AA8)-1","v":{"$error":"#VALUE!"}},{"$f":"IFERROR(INDEX($B$1:$L$38,$X8,COLUMNS($B$1:B8)),\"\")","v":""},"",{"$f":"IFERROR(VLOOKUP(8,$Y$1:$Z$20,2,FALSE),\"\")","v":""},""]
["V5004T2","V5004TY10252200","Yes",220,2200,25,6,"Linear","B","ext. thread","eq%",9,286,1870,{"$f":"P9&\":\"&COUNTIF($P$1:P9,P9)","v":"1078:2"},1078,1078,{"$f":"RANK(Q9,$Q$1:$Q$38,1)+COUNTIF($Q$1:Q9,Q9)-1","v":20},"","","","","",{"$f":"IFERROR(SMALL($W$1:$W$38,ROWS(W$1:$W9)),\"\")","v":""},{"$f":"RANK(AA9,$AA$1:$AA$20,1)+COUNTIF($AA$1:AA9,AA9)-1","v":{"$error":"#VALUE!"}},{"$f":"IFERROR(INDEX($B$1:$L$38,$X9,COLUMNS($B$1:B9)),\"\")","v":""},"",{"$f":"IFERROR(VLOOKUP(9,$Y$1:$Z$20,2,FALSE),\"\")","v":""},""]
["V5004T2","V5004TY10252700","Yes",270,2700,25,6,"Linear","B","ext. thread","eq%",10,351,2295,{"$f":"P10&\":\"&COUNTIF($P$1:P10,P10)","v":"1323:2"},1323,1323,{"$f":"RANK(Q10,$Q$1:$Q$38,1)+COUNTIF($Q$1:Q10,Q10)-1","v":22},"","","","","",{"$f":"IFERROR(SMALL($W$1:$W$38,ROWS(W$1:$W10)),\"\")","v":""},{"$f":"RANK(AA10,$AA$1:$AA$20,1)+COUNTIF($AA$1:AA10,AA10)-1","v":{"$error":"#VALUE!"}},{"$f":"IFERROR(INDEX($B$1:$L$38,$X10,COLUMNS($B$1:B10)),\"\")","v":""},"",{"$f":"IFERROR(VLOOKUP(10,$Y$1:$Z$20,2,FALSE),\"\")","v":""},""]
{"$rows_left_out":31}
{"sheet":"a","index":4,"n_rows":47,"n_cols":29,"rows_kept":47,"cut":false,"hidden":true,"merged":[]}
[null,"Therm NO","MT4-024-NO",4,"open","24Vac/dc",1,"2Pt, 3Pt","No","A",240,"With cap",1,{"$f":"VLOOKUP(Configurator_EN!N13,v!B1:I45,8,FALSE)","v":{"$error":"#N/A"}},{"$f":"IF(N1=\"A\",C1,IF(N1=\"B\",C13,IF(N1=\"R\",C43,IF(N1= \"Motor fast\",C25,IF(N1=\"I\",\"Actuator included\",\"\")))))","v":{"$error":"#N/A"}},{"$f":"IFERROR(VLOOKUP(O1,$C$1:$H$45,6,FALSE),\"\")","v":""},{"$f":"IFERROR(VLOOKUP(O1,C1:M45,11,FALSE),\"\")","v":""},{"$f":"IF(Configurator_EN!$M$1=a!P1,a!Q1,\"\")","v":""},{"$f":"IFERROR(SMALL($R$1:$R$45,ROWS($R$1:R1)),\"\")","v":""},{"$f":"IFERROR(MATCH(S1,$Q$1:$Q$45,0),\"\")","v":1},{"$f":"IFERROR(INDEX($O$1:$O$45,T1,0),\"\")","v":""},{"$f":"IF(Configurator_EN!$N$1=a!W1,a!U1,\"\")","v":""},{"$f":"IFERROR(VLOOKUP(U1,$X$1:$Y$45,2,FALSE),\"\")","v":""},"MT4-024-NO","Therm NO",{"$f":"IF(Configurator_EN!$N$1=a!W1,a!S1,\"\")","v":""},{"$f":"IFERROR(SMALL($Z$1:$Z$45,ROWS(Z$1:$Z1)),\"\")","v":""},{"$f":"IFERROR(INDEX($X$1:$X$45,AA1,1),\"\")","v":""},{"$f":"IF(AND(a!$N$1=\"I\",Configurator_EN!H16=\"Flanges\"),\"Included\",AB1)","v":{"$error":"#N/A"}}]
[null,"Therm NO","MT4-024-NO-2.5M",4,"open","24Vac/dc",2.5,"2Pt, 3Pt","No","A",240,"With cap",2,"-",{"$f":"IF(N1=\"A\",C2,IF(N1=\"B\",C14,IF(N1=\"R\",C44,IF(N1=\"Motor fast\",C26,IF(N1=\"I\",\"Actuator included\",\"\")))))","v":{"$error":"#N/A"}},{"$f":"IFERROR(VLOOKUP(O2,$C$1:$H$45,6,FALSE),\"\")","v":""},{"$f":"IFERROR(VLOOKUP(O2,C2:M46,11,FALSE),\"\")","v":""},{"$f":"IF(Configurator_EN!$M$1=a!P2,a!Q2,\"\")","v":""},{"$f":"IFERROR(SMALL($R$1:$R$45,ROWS($R$1:R2)),\"\")","v":""},{"$f":"IFERROR(MATCH(S2,$Q$1:$Q$45,0),\"\")","v":1},{"$f":"IFERROR(INDEX($O$1:$O$45,T2,0),\"\")","v":""},{"$f":"IF(Configurator_EN!$N$1=a!W2,a!U2,\"\")","v":""},{"$f":"IFERROR(VLOOKUP(U2,$X$1:$Y$45,2,FALSE),\"\")","v":""},"MT4-024-NO-2.5M","Therm NO",{"$f":"IF(Configurator_EN!$N$1=a!W2,a!S2,\"\")","v":""},{"$f":"IFERROR(SMALL($Z$1:$Z$45,ROWS(Z$1:$Z2)),\"\")","v":""},{"$f":"IFERROR(INDEX($X$1:$X$45,AA2,1),\"\")","v":""},{"$f":"IF(AND(a!$N$1=\"I\",Configurator_EN!H17=\"Flanges\"),\"Included\",AB2)","v":{"$error":"#N/A"}}]
[null,"Therm NO","MT4-024S-NO",4,"open","24Vac/dc",1,"2Pt, 3Pt",1,"A",240,"With cap",3,"2Pt, 3Pt",{"$f":"IF(N1=\"A\",C3,IF(N1=\"B\",C15,IF(N1=\"R\",C45,IF(N1=\"I\",\"Actuator included\",\"\"))))","v":{"$error":"#N/A"}},"","",{"$f":"IF(Configurator_EN!$M$1=a!P3,a!Q3,\"\")","v":""},{"$f":"IFERROR(SMALL($R$1:$R$45,ROWS($R$1:R3)),\"\")","v":""},1,"",{"$f":"IF(Configurator_EN!$N$1=a!W3,a!U3,\"\")","v":""},"","MT4-024S-NO","Therm NO",{"$f":"IF(Configurator_EN!$N$1=a!W3,a!S3,\"\")","v":""},{"$f":"IFERROR(SMALL($Z$1:$Z$45,ROWS(Z$1:$Z3)),\"\")","v":""},"",{"$f":"IF(AND(a!$N$1=\"I\",Configurator_EN!H18=\"Flanges\"),\"Included\",AB3)","v":{"$error":"#N/A"}}]
[null,"Therm NC","MT4-024-NC",4,"Close","24Vac/dc",1,"2Pt, 3Pt","No","A",240,"With cap",4,"0…10V",{"$f":"IF(N1=\"A\",C4,IF(N1=\"B\",C16,IF(N1=\"R\",\"\",IF(N1=\"I\",\"Actuator included\",\"\"))))","v":{"$error":"#N/A"}},"","",{"$f":"IF(Configurator_EN!$M$1=a!P4,a!Q4,\"\")","v":""},{"$f":"IFERROR(SMALL($R$1:$R$45,ROWS($R$1:R4)),\"\")","v":""},1,"",{"$f":"IF(Configurator_EN!$N$1=a!W4,a!U4,\"\")","v":""},"","MT4-024-NC","Therm NC",{"$f":"IF(Configurator_EN!$N$1=a!W4,a!S4,\"\")","v":""},{"$f":"IFERROR(SMALL($Z$1:$Z$45,ROWS(Z$1:$Z4)),\"\")","v":""},"",{"$f":"IF(AND(a!$N$1=\"I\",Configurator_EN!H19=\"Flanges\"),\"Included\",AB4)","v":{"$error":"#N/A"}}]
[null,"Therm NC","MT4-024-NC-2.5M",4,"Close","24Vac/dc",2.5,"2Pt, 3Pt","No","A",240,"With cap",5,"-",{"$f":"IF(N1=\"A\",C5,IF(N1=\"B\",C17,IF(N1=\"R\",\"\",IF(N1=\"I\",\"Actuator included\",\"\"))))","v":{"$error":"#N/A"}},"","",{"$f":"IF(Configurator_EN!$M$1=a!P5,a!Q5,\"\")","v":""},{"$f":"IFERROR(SMALL($R$1:$R$45,ROWS($R$1:R5)),\"\")","v":""},1,"",{"$f":"IF(Configurator_EN!$N$1=a!W5,a!U5,\"\")","v":""},"","MT4-024-NC-2.5M","Therm NC",{"$f":"IF(Configurator_EN!$N$1=a!W5,a!S5,\"\")","v":""},{"$f":"IFERROR(SMALL($Z$1:$Z$45,ROWS(Z$1:$Z5)),\"\")","v":""},"",{"$f":"IF(AND(a!$N$1=\"I\",Configurator_EN!H20=\"Flanges\"),\"Included\",AB5)","v":{"$error":"#N/A"}}]
[null,"Therm NC","MT4-024S-NC",4,"Close","24Vac/dc",1,"2Pt, 3Pt",1,"A",240,"With cap",6,"Therm NO",{"$f":"IF(N1=\"A\",C6,IF(N1=\"B\",C18,IF(N1=\"I\",\"Actuator included\",\"\")))","v":{"$error":"#N/A"}},"","",{"$f":"IF(Configurator_EN!$M$1=a!P6,a!Q6,\"\")","v":""},{"$f":"IFERROR(SMALL($R$1:$R$45,ROWS($R$1:R6)),\"\")","v":""},1,"",{"$f":"IF(Configurator_EN!$N$1=a!W6,a!U6,\"\")","v":""},"","MT4-024S-NC","Therm NC",{"$f":"IF(Configurator_EN!$N$1=a!W6,a!S6,\"\")","v":""},{"$f":"IFERROR(SMALL($Z$1:$Z$45,ROWS(Z$1:$Z6)),\"\")","v":""},"",{"$f":"IF(AND(a!$N$1=\"I\",Configurator_EN!H21=\"Flanges\"),\"Included\",AB6)","v":{"$error":"#N/A"}}]
[null,"Therm NO","MT4-230-NO",4,"open","230Vac",1,"2Pt, 3Pt","No","A",240,"With cap",7,"Therm NC",{"$f":"IF(N1=\"A\",C7,IF(N1=\"B\",C19,IF(N1=\"I\",\"Actuator included\",\"\")))","v":{"$error":"#N/A"}},"","",{"$f":"IF(Configurator_EN!$M$1=a!P7,a!Q7,\"\")","v":""},{"$f":"IFERROR(SMALL($R$1:$R$45,ROWS($R$1:R7)),\"\")","v":""},1,"",{"$f":"IF(Configurator_EN!$N$1=a!W7,a!U7,\"\")","v":""},"","MT4-230-NO","Therm NO",{"$f":"IF(Configurator_EN!$N$1=a!W7,a!S7,\"\")","v":""},{"$f":"IFERROR(SMALL($Z$1:$Z$45,ROWS(Z$1:$Z7)),\"\")","v":""},"",{"$f":"IF(AND(a!$N$1=\"I\",Configurator_EN!H22=\"Flanges\"),\"Included\",AB7)","v":{"$error":"#N/A"}}]
[null,"Therm NO","MT4-230-NO-2.5M",4,"open","230Vac",2.5,"2Pt, 3Pt","No","A",240,"With cap",8,"Motor",{"$f":"IF(N1=\"A\",C8,IF(N1=\"B\",C20,IF(N1=\"I\",\"Actuator included\",\"\")))","v":{"$error":"#N/A"}},"","",{"$f":"IF(Configurator_EN!$M$1=a!P8,a!Q8,\"\")","v":""},{"$f":"IFERROR(SMALL($R$1:$R$45,ROWS($R$1:R8)),\"\")","v":""},1,"",{"$f":"IF(Configurator_EN!$N$1=a!W8,a!U8,\"\")","v":""},"","MT4-230-NO-2.5M","Therm NO",{"$f":"IF(Configurator_EN!$N$1=a!W8,a!S8,\"\")","v":""},{"$f":"IFERROR(SMALL($Z$1:$Z$45,ROWS(Z$1:$Z8)),\"\")","v":""},"",{"$f":"IF(AND(a!$N$1=\"I\",Configurator_EN!H23=\"Flanges\"),\"Included\",AB8)","v":{"$error":"#N/A"}}]
[null,"Therm NO","MT4-230S-NO",4,"open","230Vac",1,"2Pt, 3Pt",1,"A",240,"With cap",9,null,{"$f":"IF(N1=\"A\",C9,IF(N1=\"B\",C21,IF(N1=\"I\",\"Actuator included\",\"\")))","v":{"$error":"#N/A"}},"","",{"$f":"IF(Configurator_EN!$M$1=a!P9,a!Q9,\"\")","v":""},{"$f":"IFERROR(SMALL($R$1:$R$45,ROWS($R$1:R9)),\"\")","v":""},1,"",{"$f":"IF(Configurator_EN!$N$1=a!W9,a!U9,\"\")","v":""},"","MT4-230S-NO","Therm NO",{"$f":"IF(Configurator_EN!$N$1=a!W9,a!S9,\"\")","v":""},{"$f":"IFERROR(SMALL($Z$1:$Z$45,ROWS(Z$1:$Z9)),\"\")","v":""},"",{"$f":"IF(AND(a!$N$1=\"I\",Configurator_EN!H24=\"Flanges\"),\"Included\",AB9)","v":{"$error":"#N/A"}}]
[null,"Therm NC","MT4-230-NC",4,"Close","230Vac",1,"2Pt, 3Pt","No","A",240,"With cap",10,null,{"$f":"IF(N1=\"A\",C10,IF(N1=\"B\",C22,IF(N1=\"I\",\"Actuator included\",\"\")))","v":{"$error":"#N/A"}},"","",{"$f":"IF(Configurator_EN!$M$1=a!P10,a!Q10,\"\")","v":""},{"$f":"IFERROR(SMALL($R$1:$R$45,ROWS($R$1:R10)),\"\")","v":""},1,"",{"$f":"IF(Configurator_EN!$N$1=a!W10,a!U10,\"\")","v":""},"","MT4-230-NC","Therm NC",{"$f":"IF(Configurator_EN!$N$1=a!W10,a!S10,\"\")","v":""},{"$f":"IFERROR(SMALL($Z$1:$Z$45,ROWS(Z$1:$Z10)),\"\")","v":""},"",{"$f":"IF(AND(a!$N$1=\"I\",Configurator_EN!H25=\"Flanges\"),\"Included\",AB10)","v":{"$error":"#N/A"}}]
{"$rows_left_out":38}
{"sheet":"Valves actuators list","index":5,"n_rows":49,"n_cols":4,"rows_kept":49,"cut":false,"hidden":true,"merged":[]}
["V5004TY10150150","PICV, DN15, 20…400KPA, 45…150L/H,W gauge ports ","MT4-024-NO","THERMAL ACTUATOR,   4MM,   24V,   NO"]
["V5004TY10150600","PICV, DN15, 25…400KPA, 60…600L/H,W gauge ports","MT4-024-NO-2.5M","THERMAL ACTUATOR, 4MM, 24V, NO, 2.5M"]
["V5004TY10150780","PICV, DN15, 35…400KPA, 78…780L/H,W gauge ports","MT4-024S-NO","THERMAL ACTUATOR, 4MM, 24V, NO, SWITCH"]
["V5004TY10201000","PICV, DN20, 30…400KPA, 100…1000L/H,W gauge ports","MT4-024-NC","THERMAL ACTUATOR,   4MM,  24V,   NC"]
["V5004TY10201500","PICV, DN20, 35…400KPA, 450…1500L/H,W gauge ports","MT4-024-NC-2.5M","THERMAL ACTUATOR, 4MM, 24V, NC, 2.5M"]
["V5004TY10251500","PICV, DN25, 35…400KPA, 450…1500L/H,W gauge ports","MT4-024S-NC","THERMAL ACTUATOR, 4MM, 24V, NC,  SWITCH"]
["V5004TY10202200","PICV, DN20, 25…400KPA, 220…2200L/H,W gauge ports","MT4-230-NO","THERMAL ACTUATOR,   4MM,   230V,   NO"]
["V5004TY10202700","PICV, DN20, 25…400KPA, 270…2700L/H,W gauge ports","MT4-230-NO-2.5M","THERMAL ACTUATOR, 4MM  230V,  NO,  2.5M"]
["V5004TY10252200","PICV, DN25, 25…400KPA, 220…2200L/H,W gauge ports","MT4-230S-NO","THERMAL ACTUATOR, 4MM, 230V, NO, SWITCH"]
["V5004TY10252700","PICV, DN25, 25…400KPA, 270…2700L/H,W gauge ports","MT4-230-NC","THERMAL ACTUATOR, 4MM,  230V, NC"]
{"$rows_left_out":39}